{"text_format":"3","workbook":"xlsx","n_sheets":8,"sheets":["Long Skinny to Import","Instructions","Molecule or Synonym","Batch","External ID","Well ID","Conc","Raw Data"],"not_rendered":{"macros":1},"read":"whole","date_system":"1900"}

{"sheet":"Long Skinny to Import","index":0,"n_rows":385,"n_cols":10,"rows_kept":385}
["Molecule","Batch","External ID","Plate Name","Well ID","Concentration","Raw Data"]
[{"$f":"IF(ISBLANK('Molecule or Synonym'!B2),\"\",'Molecule or Synonym'!B2)","v":""},{"$f":"IF(ISBLANK(Batch!B2),\"\",Batch!B2)","v":""},{"$f":"IF(ISBLANK('External ID'!B2),\"\",'External ID'!B2)","v":""},{"$f":"$J$2","v":"Plate 1"},{"$f":"'Well ID'!B2","v":"A1"},{"$f":"IF(ISBLANK(Conc!B2),\"\",Conc!B2)","v":""},{"$f":"IF(ISBLANK('Raw Data'!B2),\"\",'Raw Data'!B2)","v":""},null,"Unique Plate Name:","Plate 1"]
[{"$f":"IF(ISBLANK('Molecule or Synonym'!B3),\"\",'Molecule or Synonym'!B3)","v":""},{"$f":"IF(ISBLANK(Batch!B3),\"\",Batch!B3)","v":""},{"$f":"IF(ISBLANK('External ID'!B3),\"\",'External ID'!B3)","v":""},"Plate 1",{"$f":"'Well ID'!B3","v":"B1"},{"$f":"IF(ISBLANK(Conc!B3),\"\",Conc!B3)","v":""},{"$f":"IF(ISBLANK('Raw Data'!B3),\"\",'Raw Data'!B3)","v":""}]
[{"$f":"IF(ISBLANK('Molecule or Synonym'!B4),\"\",'Molecule or Synonym'!B4)","v":""},{"$f":"IF(ISBLANK(Batch!B4),\"\",Batch!B4)","v":""},{"$f":"IF(ISBLANK('External ID'!B4),\"\",'External ID'!B4)","v":""},"Plate 1",{"$f":"'Well ID'!B4","v":"C1"},{"$f":"IF(ISBLANK(Conc!B4),\"\",Conc!B4)","v":""},{"$f":"IF(ISBLANK('Raw Data'!B4),\"\",'Raw Data'!B4)","v":""},null,"a unique identifier for plate entered in cell J2"]
[{"$f":"IF(ISBLANK('Molecule or Synonym'!B5),\"\",'Molecule or Synonym'!B5)","v":""},{"$f":"IF(ISBLANK(Batch!B5),\"\",Batch!B5)","v":""},{"$f":"IF(ISBLANK('External ID'!B5),\"\",'External ID'!B5)","v":""},"Plate 1",{"$f":"'Well ID'!B5","v":"D1"},{"$f":"IF(ISBLANK(Conc!B5),\"\",Conc!B5)","v":""},{"$f":"IF(ISBLANK('Raw Data'!B5),\"\",'Raw Data'!B5)","v":""}]
[{"$f":"IF(ISBLANK('Molecule or Synonym'!B6),\"\",'Molecule or Synonym'!B6)","v":""},{"$f":"IF(ISBLANK(Batch!B6),\"\",Batch!B6)","v":""},{"$f":"IF(ISBLANK('External ID'!B6),\"\",'External ID'!B6)","v":""},"Plate 1",{"$f":"'Well ID'!B6","v":"E1"},{"$f":"IF(ISBLANK(Conc!B6),\"\",Conc!B6)","v":""},{"$f":"IF(ISBLANK('Raw Data'!B6),\"\",'Raw Data'!B6)","v":""}]
[{"$f":"IF(ISBLANK('Molecule or Synonym'!B7),\"\",'Molecule or Synonym'!B7)","v":""},{"$f":"IF(ISBLANK(Batch!B7),\"\",Batch!B7)","v":""},{"$f":"IF(ISBLANK('External ID'!B7),\"\",'External ID'!B7)","v":""},"Plate 1",{"$f":"'Well ID'!B7","v":"F1"},{"$f":"IF(ISBLANK(Conc!B7),\"\",Conc!B7)","v":""},{"$f":"IF(ISBLANK('Raw Data'!B7),\"\",'Raw Data'!B7)","v":""}]
[{"$f":"IF(ISBLANK('Molecule or Synonym'!B8),\"\",'Molecule or Synonym'!B8)","v":""},{"$f":"IF(ISBLANK(Batch!B8),\"\",Batch!B8)","v":""},{"$f":"IF(ISBLANK('External ID'!B8),\"\",'External ID'!B8)","v":""},"Plate 1",{"$f":"'Well ID'!B8","v":"G1"},{"$f":"IF(ISBLANK(Conc!B8),\"\",Conc!B8)","v":""},{"$f":"IF(ISBLANK('Raw Data'!B8),\"\",'Raw Data'!B8)","v":""}]
[{"$f":"IF(ISBLANK('Molecule or Synonym'!B9),\"\",'Molecule or Synonym'!B9)","v":""},{"$f":"IF(ISBLANK(Batch!B9),\"\",Batch!B9)","v":""},{"$f":"IF(ISBLANK('External ID'!B9),\"\",'External ID'!B9)","v":""},"Plate 1",{"$f":"'Well ID'!B9","v":"H1"},{"$f":"IF(ISBLANK(Conc!B9),\"\",Conc!B9)","v":""},{"$f":"IF(ISBLANK('Raw Data'!B9),\"\",'Raw Data'!B9)","v":""}]
[{"$f":"IF(ISBLANK('Molecule or Synonym'!B10),\"\",'Molecule or Synonym'!B10)","v":""},{"$f":"IF(ISBLANK(Batch!B10),\"\",Batch!B10)","v":""},{"$f":"IF(ISBLANK('External ID'!B10),\"\",'External ID'!B10)","v":""},"Plate 1",{"$f":"'Well ID'!B10","v":"I1"},{"$f":"IF(ISBLANK(Conc!B10),\"\",Conc!B10)","v":""},{"$f":"IF(ISBLANK('Raw Data'!B10),\"\",'Raw Data'!B10)","v":""}]
[{"$f":"IF(ISBLANK('Molecule or Synonym'!B11),\"\",'Molecule or Synonym'!B11)","v":""},{"$f":"IF(ISBLANK(Batch!B11),\"\",Batch!B11)","v":""},{"$f":"IF(ISBLANK('External ID'!B11),\"\",'External ID'!B11)","v":""},"Plate 1",{"$f":"'Well ID'!B11","v":"J1"},{"$f":"IF(ISBLANK(Conc!B11),\"\",Conc!B11)","v":""},{"$f":"IF(ISBLANK('Raw Data'!B11),\"\",'Raw Data'!B11)","v":""}]
[{"$f":"IF(ISBLANK('Molecule or Synonym'!B12),\"\",'Molecule or Synonym'!B12)","v":""},{"$f":"IF(ISBLANK(Batch!B12),\"\",Batch!B12)","v":""},{"$f":"IF(ISBLANK('External ID'!B12),\"\",'External ID'!B12)","v":""},"Plate 1",{"$f":"'Well ID'!B12","v":"K1"},{"$f":"IF(ISBLANK(Conc!B12),\"\",Conc!B12)","v":""},{"$f":"IF(ISBLANK('Raw Data'!B12),\"\",'Raw Data'!B12)","v":""}]
[{"$f":"IF(ISBLANK('Molecule or Synonym'!B13),\"\",'Molecule or Synonym'!B13)","v":""},{"$f":"IF(ISBLANK(Batch!B13),\"\",Batch!B13)","v":""},{"$f":"IF(ISBLANK('External ID'!B13),\"\",'External ID'!B13)","v":""},"Plate 1",{"$f":"'Well ID'!B13","v":"L1"},{"$f":"IF(ISBLANK(Conc!B13),\"\",Conc!B13)","v":""},{"$f":"IF(ISBLANK('Raw Data'!B13),\"\",'Raw Data'!B13)","v":""}]
[{"$f":"IF(ISBLANK('Molecule or Synonym'!B14),\"\",'Molecule or Synonym'!B14)","v":""},{"$f":"IF(ISBLANK(Batch!B14),\"\",Batch!B14)","v":""},{"$f":"IF(ISBLANK('External ID'!B14),\"\",'External ID'!B14)","v":""},"Plate 1",{"$f":"'Well ID'!B14","v":"M1"},{"$f":"IF(ISBLANK(Conc!B14),\"\",Conc!B14)","v":""},{"$f":"IF(ISBLANK('Raw Data'!B14),\"\",'Raw Data'!B14)","v":""}]
[{"$f":"IF(ISBLANK('Molecule or Synonym'!B15),\"\",'Molecule or Synonym'!B15)","v":""},{"$f":"IF(ISBLANK(Batch!B15),\"\",Batch!B15)","v":""},{"$f":"IF(ISBLANK('External ID'!B15),\"\",'External ID'!B15)","v":""},"Plate 1",{"$f":"'Well ID'!B15","v":"N1"},{"$f":"IF(ISBLANK(Conc!B15),\"\",Conc!B15)","v":""},{"$f":"IF(ISBLANK('Raw Data'!B15),\"\",'Raw Data'!B15)","v":""}]
[{"$f":"IF(ISBLANK('Molecule or Synonym'!B16),\"\",'Molecule or Synonym'!B16)","v":""},{"$f":"IF(ISBLANK(Batch!B16),\"\",Batch!B16)","v":""},{"$f":"IF(ISBLANK('External ID'!B16),\"\",'External ID'!B16)","v":""},"Plate 1",{"$f":"'Well ID'!B16","v":"O1"},{"$f":"IF(ISBLANK(Conc!B16),\"\",Conc!B16)","v":""},{"$f":"IF(ISBLANK('Raw Data'!B16),\"\",'Raw Data'!B16)","v":""}]
[{"$f":"IF(ISBLANK('Molecule or Synonym'!B17),\"\",'Molecule or Synonym'!B17)","v":""},{"$f":"IF(ISBLANK(Batch!B17),\"\",Batch!B17)","v":""},{"$f":"IF(ISBLANK('External ID'!B17),\"\",'External ID'!B17)","v":""},"Plate 1",{"$f":"'Well ID'!B17","v":"P1"},{"$f":"IF(ISBLANK(Conc!B17),\"\",Conc!B17)","v":""},{"$f":"IF(ISBLANK('Raw Data'!B17),\"\",'Raw Data'!B17)","v":""}]
[{"$f":"IF(ISBLANK('Molecule or Synonym'!C2),\"\",'Molecule or Synonym'!C2)","v":""},{"$f":"IF(ISBLANK(Batch!C2),\"\",Batch!C2)","v":""},{"$f":"IF(ISBLANK('External ID'!C2),\"\",'External ID'!C2)","v":""},"Plate 1",{"$f":"'Well ID'!C2","v":"A2"},{"$f":"IF(ISBLANK(Conc!C2),\"\",Conc!C2)","v":""},{"$f":"IF(ISBLANK('Raw Data'!C2),\"\",'Raw Data'!C2)","v":""}]
[{"$f":"IF(ISBLANK('Molecule or Synonym'!C3),\"\",'Molecule or Synonym'!C3)","v":""},{"$f":"IF(ISBLANK(Batch!C3),\"\",Batch!C3)","v":""},{"$f":"IF(ISBLANK('External ID'!C3),\"\",'External ID'!C3)","v":""},"Plate 1",{"$f":"'Well ID'!C3","v":"B2"},{"$f":"IF(ISBLANK(Conc!C3),\"\",Conc!C3)","v":""},{"$f":"IF(ISBLANK('Raw Data'!C3),\"\",'Raw Data'!C3)","v":""}]
[{"$f":"IF(ISBLANK('Molecule or Synonym'!C4),\"\",'Molecule or Synonym'!C4)","v":""},{"$f":"IF(ISBLANK(Batch!C4),\"\",Batch!C4)","v":""},{"$f":"IF(ISBLANK('External ID'!C4),\"\",'External ID'!C4)","v":""},"Plate 1",{"$f":"'Well ID'!C4","v":"C2"},{"$f":"IF(ISBLANK(Conc!C4),\"\",Conc!C4)","v":""},{"$f":"IF(ISBLANK('Raw Data'!C4),\"\",'Raw Data'!C4)","v":""}]
[{"$f":"IF(ISBLANK('Molecule or Synonym'!C5),\"\",'Molecule or Synonym'!C5)","v":""},{"$f":"IF(ISBLANK(Batch!C5),\"\",Batch!C5)","v":""},{"$f":"IF(ISBLANK('External ID'!C5),\"\",'External ID'!C5)","v":""},"Plate 1",{"$f":"'Well ID'!C5","v":"D2"},{"$f":"IF(ISBLANK(Conc!C5),\"\",Conc!C5)","v":""},{"$f":"IF(ISBLANK('Raw Data'!C5),\"\",'Raw Data'!C5)","v":""}]
[{"$f":"IF(ISBLANK('Molecule or Synonym'!C6),\"\",'Molecule or Synonym'!C6)","v":""},{"$f":"IF(ISBLANK(Batch!C6),\"\",Batch!C6)","v":""},{"$f":"IF(ISBLANK('External ID'!C6),\"\",'External ID'!C6)","v":""},"Plate 1",{"$f":"'Well ID'!C6","v":"E2"},{"$f":"IF(ISBLANK(Conc!C6),\"\",Conc!C6)","v":""},{"$f":"IF(ISBLANK('Raw Data'!C6),\"\",'Raw Data'!C6)","v":""}]
[{"$f":"IF(ISBLANK('Molecule or Synonym'!C7),\"\",'Molecule or Synonym'!C7)","v":""},{"$f":"IF(ISBLANK(Batch!C7),\"\",Batch!C7)","v":""},{"$f":"IF(ISBLANK('External ID'!C7),\"\",'External ID'!C7)","v":""},"Plate 1",{"$f":"'Well ID'!C7","v":"F2"},{"$f":"IF(ISBLANK(Conc!C7),\"\",Conc!C7)","v":""},{"$f":"IF(ISBLANK('Raw Data'!C7),\"\",'Raw Data'!C7)","v":""}]
[{"$f":"IF(ISBLANK('Molecule or Synonym'!C8),\"\",'Molecule or Synonym'!C8)","v":""},{"$f":"IF(ISBLANK(Batch!C8),\"\",Batch!C8)","v":""},{"$f":"IF(ISBLANK('External ID'!C8),\"\",'External ID'!C8)","v":""},"Plate 1",{"$f":"'Well ID'!C8","v":"G2"},{"$f":"IF(ISBLANK(Conc!C8),\"\",Conc!C8)","v":""},{"$f":"IF(ISBLANK('Raw Data'!C8),\"\",'Raw Data'!C8)","v":""}]
[{"$f":"IF(ISBLANK('Molecule or Synonym'!C9),\"\",'Molecule or Synonym'!C9)","v":""},{"$f":"IF(ISBLANK(Batch!C9),\"\",Batch!C9)","v":""},{"$f":"IF(ISBLANK('External ID'!C9),\"\",'External ID'!C9)","v":""},"Plate 1",{"$f":"'Well ID'!C9","v":"H2"},{"$f":"IF(ISBLANK(Conc!C9),\"\",Conc!C9)","v":""},{"$f":"IF(ISBLANK('Raw Data'!C9),\"\",'Raw Data'!C9)","v":""}]
[{"$f":"IF(ISBLANK('Molecule or Synonym'!C10),\"\",'Molecule or Synonym'!C10)","v":""},{"$f":"IF(ISBLANK(Batch!C10),\"\",Batch!C10)","v":""},{"$f":"IF(ISBLANK('External ID'!C10),\"\",'External ID'!C10)","v":""},"Plate 1",{"$f":"'Well ID'!C10","v":"I2"},{"$f":"IF(ISBLANK(Conc!C10),\"\",Conc!C10)","v":""},{"$f":"IF(ISBLANK('Raw Data'!C10),\"\",'Raw Data'!C10)","v":""}]
[{"$f":"IF(ISBLANK('Molecule or Synonym'!C11),\"\",'Molecule or Synonym'!C11)","v":""},{"$f":"IF(ISBLANK(Batch!C11),\"\",Batch!C11)","v":""},{"$f":"IF(ISBLANK('External ID'!C11),\"\",'External ID'!C11)","v":""},"Plate 1",{"$f":"'Well ID'!C11","v":"J2"},{"$f":"IF(ISBLANK(Conc!C11),\"\",Conc!C11)","v":""},{"$f":"IF(ISBLANK('Raw Data'!C11),\"\",'Raw Data'!C11)","v":""}]
[{"$f":"IF(ISBLANK('Molecule or Synonym'!C12),\"\",'Molecule or Synonym'!C12)","v":""},{"$f":"IF(ISBLANK(Batch!C12),\"\",Batch!C12)","v":""},{"$f":"IF(ISBLANK('External ID'!C12),\"\",'External ID'!C12)","v":""},"Plate 1",{"$f":"'Well ID'!C12","v":"K2"},{"$f":"IF(ISBLANK(Conc!C12),\"\",Conc!C12)","v":""},{"$f":"IF(ISBLANK('Raw Data'!C12),\"\",'Raw Data'!C12)","v":""}]
[{"$f":"IF(ISBLANK('Molecule or Synonym'!C13),\"\",'Molecule or Synonym'!C13)","v":""},{"$f":"IF(ISBLANK(Batch!C13),\"\",Batch!C13)","v":""},{"$f":"IF(ISBLANK('External ID'!C13),\"\",'External ID'!C13)","v":""},"Plate 1",{"$f":"'Well ID'!C13","v":"L2"},{"$f":"IF(ISBLANK(Conc!C13),\"\",Conc!C13)","v":""},{"$f":"IF(ISBLANK('Raw Data'!C13),\"\",'Raw Data'!C13)","v":""}]
[{"$f":"IF(ISBLANK('Molecule or Synonym'!C14),\"\",'Molecule or Synonym'!C14)","v":""},{"$f":"IF(ISBLANK(Batch!C14),\"\",Batch!C14)","v":""},{"$f":"IF(ISBLANK('External ID'!C14),\"\",'External ID'!C14)","v":""},"Plate 1",{"$f":"'Well ID'!C14","v":"M2"},{"$f":"IF(ISBLANK(Conc!C14),\"\",Conc!C14)","v":""},{"$f":"IF(ISBLANK('Raw Data'!C14),\"\",'Raw Data'!C14)","v":""}]
[{"$f":"IF(ISBLANK('Molecule or Synonym'!C15),\"\",'Molecule or Synonym'!C15)","v":""},{"$f":"IF(ISBLANK(Batch!C15),\"\",Batch!C15)","v":""},{"$f":"IF(ISBLANK('External ID'!C15),\"\",'External ID'!C15)","v":""},"Plate 1",{"$f":"'Well ID'!C15","v":"N2"},{"$f":"IF(ISBLANK(Conc!C15),\"\",Conc!C15)","v":""},{"$f":"IF(ISBLANK('Raw Data'!C15),\"\",'Raw Data'!C15)","v":""}]
[{"$f":"IF(ISBLANK('Molecule or Synonym'!C16),\"\",'Molecule or Synonym'!C16)","v":""},{"$f":"IF(ISBLANK(Batch!C16),\"\",Batch!C16)","v":""},{"$f":"IF(ISBLANK('External ID'!C16),\"\",'External ID'!C16)","v":""},"Plate 1",{"$f":"'Well ID'!C16","v":"O2"},{"$f":"IF(ISBLANK(Conc!C16),\"\",Conc!C16)","v":""},{"$f":"IF(ISBLANK('Raw Data'!C16),\"\",'Raw Data'!C16)","v":""}]
[{"$f":"IF(ISBLANK('Molecule or Synonym'!C17),\"\",'Molecule or Synonym'!C17)","v":""},{"$f":"IF(ISBLANK(Batch!C17),\"\",Batch!C17)","v":""},{"$f":"IF(ISBLANK('External ID'!C17),\"\",'External ID'!C17)","v":""},"Plate 1",{"$f":"'Well ID'!C17","v":"P2"},{"$f":"IF(ISBLANK(Conc!C17),\"\",Conc!C17)","v":""},{"$f":"IF(ISBLANK('Raw Data'!C17),\"\",'Raw Data'!C17)","v":""}]
[{"$f":"IF(ISBLANK('Molecule or Synonym'!D2),\"\",'Molecule or Synonym'!D2)","v":""},{"$f":"IF(ISBLANK(Batch!D2),\"\",Batch!D2)","v":""},{"$f":"IF(ISBLANK('External ID'!D2),\"\",'External ID'!D2)","v":""},"Plate 1",{"$f":"'Well ID'!D2","v":"A3"},{"$f":"IF(ISBLANK(Conc!D2),\"\",Conc!D2)","v":""},{"$f":"IF(ISBLANK('Raw Data'!D2),\"\",'Raw Data'!D2)","v":""}]
[{"$f":"IF(ISBLANK('Molecule or Synonym'!D3),\"\",'Molecule or Synonym'!D3)","v":""},{"$f":"IF(ISBLANK(Batch!D3),\"\",Batch!D3)","v":""},{"$f":"IF(ISBLANK('External ID'!D3),\"\",'External ID'!D3)","v":""},"Plate 1",{"$f":"'Well ID'!D3","v":"B3"},{"$f":"IF(ISBLANK(Conc!D3),\"\",Conc!D3)","v":""},{"$f":"IF(ISBLANK('Raw Data'!D3),\"\",'Raw Data'!D3)","v":""}]
[{"$f":"IF(ISBLANK('Molecule or Synonym'!D4),\"\",'Molecule or Synonym'!D4)","v":""},{"$f":"IF(ISBLANK(Batch!D4),\"\",Batch!D4)","v":""},{"$f":"IF(ISBLANK('External ID'!D4),\"\",'External ID'!D4)","v":""},"Plate 1",{"$f":"'Well ID'!D4","v":"C3"},{"$f":"IF(ISBLANK(Conc!D4),\"\",Conc!D4)","v":""},{"$f":"IF(ISBLANK('Raw Data'!D4),\"\",'Raw Data'!D4)","v":""}]
[{"$f":"IF(ISBLANK('Molecule or Synonym'!D5),\"\",'Molecule or Synonym'!D5)","v":""},{"$f":"IF(ISBLANK(Batch!D5),\"\",Batch!D5)","v":""},{"$f":"IF(ISBLANK('External ID'!D5),\"\",'External ID'!D5)","v":""},"Plate 1",{"$f":"'Well ID'!D5","v":"D3"},{"$f":"IF(ISBLANK(Conc!D5),\"\",Conc!D5)","v":""},{"$f":"IF(ISBLANK('Raw Data'!D5),\"\",'Raw Data'!D5)","v":""}]
[{"$f":"IF(ISBLANK('Molecule or Synonym'!D6),\"\",'Molecule or Synonym'!D6)","v":""},{"$f":"IF(ISBLANK(Batch!D6),\"\",Batch!D6)","v":""},{"$f":"IF(ISBLANK('External ID'!D6),\"\",'External ID'!D6)","v":""},"Plate 1",{"$f":"'Well ID'!D6","v":"E3"},{"$f":"IF(ISBLANK(Conc!D6),\"\",Conc!D6)","v":""},{"$f":"IF(ISBLANK('Raw Data'!D6),\"\",'Raw Data'!D6)","v":""}]
[{"$f":"IF(ISBLANK('Molecule or Synonym'!D7),\"\",'Molecule or Synonym'!D7)","v":""},{"$f":"IF(ISBLANK(Batch!D7),\"\",Batch!D7)","v":""},{"$f":"IF(ISBLANK('External ID'!D7),\"\",'External ID'!D7)","v":""},"Plate 1",{"$f":"'Well ID'!D7","v":"F3"},{"$f":"IF(ISBLANK(Conc!D7),\"\",Conc!D7)","v":""},{"$f":"IF(ISBLANK('Raw Data'!D7),\"\",'Raw Data'!D7)","v":""}]
[{"$f":"IF(ISBLANK('Molecule or Synonym'!D8),\"\",'Molecule or Synonym'!D8)","v":""},{"$f":"IF(ISBLANK(Batch!D8),\"\",Batch!D8)","v":""},{"$f":"IF(ISBLANK('External ID'!D8),\"\",'External ID'!D8)","v":""},"Plate 1",{"$f":"'Well ID'!D8","v":"G3"},{"$f":"IF(ISBLANK(Conc!D8),\"\",Conc!D8)","v":""},{"$f":"IF(ISBLANK('Raw Data'!D8),\"\",'Raw Data'!D8)","v":""}]
{"$rows_left_out":346}
{"sheet":"Instructions","index":1,"n_rows":21,"n_cols":3,"rows_kept":21,"merged":[[6,1,7,17],[13,1,14,17],[18,2,19,17],[20,2,21,17]]}
["Use this file to convert your plate-formatted data in 96-well format to  the long and skinny format to upload data into CDD Vault"]
[]
["Tabs"]
["1.","Compound - populate the wells with the Molecule/Compound name (prefix-XXXXXXX)"]
["2.","Batch - populate the wells with the Batch Name of the Molecule/Compound/Synonym name, i.e., 1, 2 or 3, etc."]
["3.","External ID - if you've created a batch user-defined field that aliases a specific batch of a molecule, instead of mapping both Molecule and Batch Name, you may just map External ID"]
["4.","Conc - input (number formatted) concentrations for each well, leave positive and negative control wells blank; note that this should all be in the same units and comply with your protocol definition"]
[]
["5.","Raw Data - copy and paste your plate-formatted raw data into the appropriate cells"]
[]
["Review and Import File"]
["1.","Once data is entered into the appropriate tabs, review the long and skinny table to import (first tab)"]
["2.","If you have more than one plate of data for a run, use this same template to enter new plate data by clicking the Add New Plate Data button"]
["3.","After clicking on the Add New Data button, new rows will be entered at the top for your new plate of data. Repeat previous steps to enter data for another plate; if needed, clear out the concentration data on the concentration tab"]
[]
["4.","Optional: delete any unwanted rows of data"]
["5.","Positive and Negative Control Data: In the Molecule, Batch and/or External ID columns, the cells should be empty. Your control data is determined by your control layout."]
["6.","Save the file and proceed to importing the file via the Data Import Wizard in CDD Vault"]
[null,"a.","Saving as an .xlsx file - Copy and paste the values of the Long and Skinny tab in place; this helps to avoid any errors that may come from formulas written into Excel; note that CDD Vault only looks at the first tab of the .xlsx file for import"]
[]
[null,"b.","Saving as a .csv file (recommended) - Go to File > save as and save as the csv (comma delimited) format; use this to avoid the error that may come from formulas written into Excel; use this format if you wish to attach this file in an ELN entry and import from the ELN; at current time import of the .xlsx format in not supported via the ELN"]

{"sheet":"Molecule or Synonym","index":2,"n_rows":20,"n_cols":25,"rows_kept":20}
[null,1,2,3,4,5,6,7,8,9,10,11,12,13,14,15,16,17,18,19,20,21,22,23,24]
["A"]
["B"]
["C"]
["D"]
["E"]
["F"]
["G"]
["H"]
["I"]
["J"]
["K"]
["L"]
["M"]
["N"]
["O"]
["P"]
[]
[]
["Prefix-XXXXXXX\ncompound or synonym"]

{"sheet":"Batch","index":3,"n_rows":20,"n_cols":25,"rows_kept":20}
[null,1,2,3,4,5,6,7,8,9,10,11,12,13,14,15,16,17,18,19,20,21,22,23,24]
["A"]
["B"]
["C"]
["D"]
["E"]
["F"]
["G"]
["H"]
["I"]
["J"]
["K"]
["L"]
["M"]
["N"]
["O"]
["P"]
[]
[]
["1, 2 , 3 etc\nbatch"]

{"sheet":"External ID","index":4,"n_rows":20,"n_cols":25,"rows_kept":20}
[null,1,2,3,4,5,6,7,8,9,10,11,12,13,14,15,16,17,18,19,20,21,22,23,24]
["A"]
["B"]
["C"]
["D"]
["E"]
["F"]
["G"]
["H"]
["I"]
["J"]
["K"]
["L"]
["M"]
["N"]
["O"]
["P"]
[]
[]
["external ID = batch of a molecule (batch UDF)"]

{"sheet":"Well ID","index":5,"n_rows":17,"n_cols":25,"rows_kept":17,"hidden":true}
[null,1,2,3,4,5,6,7,8,9,10,11,12,13,14,15,16,17,18,19,20,21,22,23,24]
["A",{"$f":"$A2&$B$1","v":"A1"},{"$f":"$A2&C$1","v":"A2"},"A3","A4","A5","A6","A7","A8","A9","A10","A11","A12","A13","A14","A15","A16","A17","A18","A19","A20","A21","A22","A23","A24"]
["B",{"$f":"$A3&$B$1","v":"B1"},{"$f":"$A3&C$1","v":"B2"},"B3","B4","B5","B6","B7","B8","B9","B10","B11","B12","B13","B14","B15","B16","B17","B18","B19","B20","B21","B22","B23","B24"]
["C","C1","C2","C3","C4","C5","C6","C7","C8","C9","C10","C11","C12","C13","C14","C15","C16","C17","C18","C19","C20","C21","C22","C23","C24"]
["D","D1","D2","D3","D4","D5","D6","D7","D8","D9","D10","D11","D12","D13","D14","D15","D16","D17","D18","D19","D20","D21","D22","D23","D24"]
["E","E1","E2","E3","E4","E5","E6","E7","E8","E9","E10","E11","E12","E13","E14","E15","E16","E17","E18","E19","E20","E21","E22","E23","E24"]
["F","F1","F2","F3","F4","F5","F6","F7","F8","F9","F10","F11","F12","F13","F14","F15","F16","F17","F18","F19","F20","F21","F22","F23","F24"]
["G",{"$f":"$A8&$B$1","v":"G1"},"G2","G3","G4","G5","G6","G7","G8","G9","G10","G11","G12","G13","G14","G15","G16","G17","G18","G19","G20","G21","G22","G23","G24"]
["H","H1","H2","H3","H4","H5","H6","H7","H8","H9","H10","H11","H12","H13","H14","H15","H16","H17","H18","H19","H20","H21","H22","H23","H24"]
["I","I1","I2","I3","I4","I5","I6","I7","I8","I9","I10","I11","I12","I13","I14","I15","I16","I17","I18","I19","I20","I21","I22","I23","I24"]
["J","J1","J2","J3","J4","J5","J6","J7","J8","J9","J10","J11","J12","J13","J14","J15","J16","J17","J18","J19","J20","J21","J22","J23","J24"]
["K","K1","K2","K3","K4","K5","K6","K7","K8","K9","K10","K11","K12","K13","K14","K15","K16","K17","K18","K19","K20","K21","K22","K23","K24"]
["L","L1","L2","L3","L4","L5","L6","L7","L8","L9","L10","L11","L12","L13","L14","L15","L16","L17","L18","L19","L20","L21","L22","L23","L24"]
["M","M1","M2","M3","M4","M5","M6","M7","M8","M9","M10","M11","M12","M13","M14","M15","M16","M17","M18","M19","M20","M21","M22","M23","M24"]
["N","N1","N2","N3","N4","N5","N6","N7","N8","N9","N10","N11","N12","N13","N14","N15","N16","N17","N18","N19","N20","N21","N22","N23","N24"]
["O","O1","O2","O3","O4","O5","O6","O7","O8","O9","O10","O11","O12","O13","O14","O15","O16","O17","O18","O19","O20","O21","O22","O23","O24"]
["P","P1","P2","P3","P4","P5","P6","P7","P8","P9","P10","P11","P12","P13","P14","P15","P16","P17","P18","P19","P20","P21","P22","P23","P24"]

{"sheet":"Conc","index":6,"n_rows":20,"n_cols":25,"rows_kept":20}
[null,1,2,3,4,5,6,7,8,9,10,11,12,13,14,15,16,17,18,19,20,21,22,23,24]
["A"]
["B"]
["C"]
["D"]
["E"]
["F"]
["G"]
["H"]
["I"]
["J"]
["K"]
["L"]
["M"]
["N"]
["O"]
["P"]
[]
[]
["consistent units (uM, nM)\nConc"]

{"sheet":"Raw Data","index":7,"n_rows":20,"n_cols":25,"rows_kept":20}
[null,1,2,3,4,5,6,7,8,9,10,11,12,13,14,15,16,17,18,19,20,21,22,23,24]
["A"]
["B"]
["C"]
["D"]
["E"]
["F"]
["G"]
["H"]
["I"]
["J"]
["K"]
["L"]
["M"]
["N"]
["O"]
["P"]
[]
[]
["Abs, RFU, OD, etc\nRaw Data"]